{"text_format":"1","workbook":"xlsx","n_sheets":9,"sheets":["Title","Blackblot Hootsuite Uploader 1","Blackblot Hootsuite Uploader 2","Blackblot Hootsuite Uploader 3","Blackblot Hootsuite Uploader 4","Blackblot Hootsuite Uploader 5","Blackblot Hootsuite Uploader 6","Settings","Instructions"],"not_rendered":{"charts":0,"images":1,"macros":1,"external_links":0,"defined_names":25,"comments":7,"pivot_tables":0},"unopened":[],"bounds":{"document_bytes":16777216,"sheet_cells":100000,"rows_first":2000,"rows_last":500,"rows_between":2000,"halvings":0,"cell_chars":16384,"cell_head_chars":4096},"cells_cut":0,"cells_raw":0,"read":"whole","date_system":"1900"}

{"sheet":"Title","index":0,"n_rows":34,"n_cols":10,"rows_kept":34,"cut":false,"hidden":false,"merged":[[36,3,36,4],[36,5,36,6],[36,7,36,8],[36,9,36,10],[34,3,34,4],[34,5,34,6],[34,7,34,8],[34,9,34,10],[35,3,35,4],[35,5,35,6],[35,7,35,8],[35,9,35,10],[32,3,32,4],[32,5,32,6],[32,7,32,8],[32,9,32,10],[33,3,33,4],[33,5,33,6],[33,7,33,8],[33,9,33,10],[25,4,25,5],[25,7,25,12],[26,4,26,5],[26,7,26,12],[27,4,27,5],[27,7,27,12],[22,4,22,5],[22,7,22,12],[23,4,23,5],[23,7,23,12],[24,4,24,5],[24,7,24,12],[0,2,0,13],[19,4,19,5],[19,7,19,12],[1,2,1,13],[15,2,15,12],[18,4,18,5],[18,7,18,12]]}
[null,null,"Blackblot®"]
[null,null,"Hootsuite Uploader Matrix"]
[]
[]
[]
[]
[]
[]
[]
[]
[]
[]
[]
[]
[]
{"$rows_left_out":20}
{"sheet":"Blackblot Hootsuite Uploader 1","index":1,"n_rows":107,"n_cols":9,"rows_kept":107,"cut":false,"hidden":false,"merged":[[0,3,2,5]]}
["Start Date:","2015-07-26",null,"Blackblot® Hootsuite Uploader Matrix"]
["Skipday:",2]
["Channel:","Twitter "]
["Date Format:","USA"]
["Check URL",true,null,null,null,null,{"$f":"VLOOKUP(B3,Settings!C8:D11,2)","v":140}]
[]
["Weekday","Date","Hour","#","Message","URL","Text Length","Uploader","Randomizer"]
[{"$f":"+B8","v":"2015-07-26"},{"$f":"+B1","v":"2015-07-26"},"09:00:00",1,"Blackblot Video - What is Product Management? #prodmgmt #prodmktg","http://www.blackblot.com/video/",{"$f":"LEN(TRIM(E8)) + LEN(TRIM(F8))","v":96},{"$f":"CONCATENATE(IF($B$4=\"USA\",CONCATENATE(TEXT(MONTH(B8),\"00\"),\"/\",TEXT(DAY(B8),\"00\"),\"/\",TEXT(YEAR(B8),\"0000\")),CONCATENATE(TEXT(DAY(B8),\"00\"),\"/\",TEXT(MONTH(B8),\"00\"),\"/\",TEXT(YEAR(B8),\"0000\"))),\" \",TEXT(HOUR(C8),\"00\"),\":\",TEXT(MINUTE(C8),\"00\"),\",\"&CHAR(34),TRIM(E8),CHAR(34)&\",\"&CHAR(34),TRIM(F8),CHAR(34))","v":"07/26/2015 09:00,\"Blackblot Video - What is Product Management? #prodmgmt #prodmktg\",\"http://www.blackblot.com/video/\""},{"$f":"RAND()*100","v":95.00012868112826}]
["2015-07-28",{"$f":"+B8+$B$2","v":"2015-07-28"},"23:30:00",2,"Blackblot Training Program Benefits - comprehensive study program #prodmgmt #HR","http://www.blackblot.com/benefits/",113,"07/28/2015 23:30,\"Blackblot Training Program Benefits - comprehensive study program #prodmgmt #HR\",\"http://www.blackblot.com/benefits/\"",18.35402679812227]
["2015-07-30","2015-07-30","01:00:00",3,"Market-Value Pricing Model - Blackblot PMTK (Blackblot Product Manager's Toolkit™) #PMTK #prodmgmt #pricing","http://www.blackblot.com/mvp-model/",142,"07/30/2015 01:00,\"Market-Value Pricing Model - Blackblot PMTK (Blackblot Product Manager's Toolkit™) #PMTK #prodmgmt #pricing\",\"http://www.blackblot.com/mvp-model/\"",61.630833026781971]
["2015-08-01","2015-08-01","13:45:00",4,"What makes Blackblot different?","http://www.blackblot.com/",56,"08/01/2015 13:45,\"What makes Blackblot different?\",\"http://www.blackblot.com/\"",42.523471077358423]
["2015-08-03","2015-08-03","15:00:00",5,"What is considered to be a good ratio of product engineers to product managers? #prodmgmt","http://www.blackblot.com/kb/dev-pm/pm-to-dev-ratio/",140,"08/03/2015 15:00,\"What is considered to be a good ratio of product engineers to product managers? #prodmgmt\",\"http://www.blackblot.com/kb/dev-pm/pm-to-dev-ratio/\"",62.424401640756599]
["2015-08-05","2015-08-05","09:00:00",6,"Blackblot enables product managers to be more productive via unique and unsurpassed offering #prodmgmt #PMTK","http://www.blackblot.com/offering/",142,"08/05/2015 09:00,\"Blackblot enables product managers to be more productive via unique and unsurpassed offering #prodmgmt #PMTK\",\"http://www.blackblot.com/offering/\"",77.381339614230328]
["2015-08-07","2015-08-07","23:30:00",7,"Gauge the level of maturity of the #prodmgmt practice at your company. ","http://www.blackblot.com/pmeval/",102,"08/07/2015 23:30,\"Gauge the level of maturity of the #prodmgmt practice at your company.\",\"http://www.blackblot.com/pmeval/\"",42.758106246267445]
["2015-08-09","2015-08-09","01:00:00",8,"A new tool for HR managers and recruiters: The Blackblot Psychometric Test™ (BPT) #ProductManagement #HR","http://www.blackblot.com/bpt/",133,"08/09/2015 01:00,\"A new tool for HR managers and recruiters: The Blackblot Psychometric Test™ (BPT) #ProductManagement #HR\",\"http://www.blackblot.com/bpt/\"",9.839961516527385]
{"$rows_left_out":93}
{"sheet":"Blackblot Hootsuite Uploader 2","index":2,"n_rows":107,"n_cols":9,"rows_kept":107,"cut":false,"hidden":false,"merged":[[0,3,2,5]]}
["Start Date:","2015-07-26",null,"Blackblot® Hootsuite Uploader Matrix"]
["Skipday:",2]
["Channel:","Twitter "]
["Date Format:","USA"]
["Check URL",true,null,null,null,null,{"$f":"VLOOKUP(B3,Settings!C8:D11,2)","v":140}]
[]
["Weekday","Date","Hour","#","Message","URL","Text Length","Uploader","Randomizer"]
[{"$f":"+B8","v":"2015-07-26"},{"$f":"+B1","v":"2015-07-26"},"09:00:00",1,"Blackblot's book on #prodmgmt  - The Product Manager's Toolkit™","http://www.blackblot.com/pmtk-book/",{"$f":"LEN(TRIM(E8)) + LEN(TRIM(F8))","v":97},{"$f":"CONCATENATE(IF($B$4=\"USA\",CONCATENATE(TEXT(MONTH(B8),\"00\"),\"/\",TEXT(DAY(B8),\"00\"),\"/\",TEXT(YEAR(B8),\"0000\")),CONCATENATE(TEXT(DAY(B8),\"00\"),\"/\",TEXT(MONTH(B8),\"00\"),\"/\",TEXT(YEAR(B8),\"0000\"))),\" \",TEXT(HOUR(C8),\"00\"),\":\",TEXT(MINUTE(C8),\"00\"),\",\"&CHAR(34),TRIM(E8),CHAR(34)&\",\"&CHAR(34),TRIM(F8),CHAR(34))","v":"07/26/2015 09:00,\"Blackblot's book on #prodmgmt - The Product Manager's Toolkit™\",\"http://www.blackblot.com/pmtk-book/\""},{"$f":"RAND()*100","v":37.214182923550823}]
["2015-07-28",{"$f":"+B8+$B$2","v":"2015-07-28"},"23:30:00",2,"The Blackblot Personal Career Package™ is a professional advisory service #prodmgmt #prodmktg","http://www.blackblot.com/bcp/",122,"07/28/2015 23:30,\"The Blackblot Personal Career Package™ is a professional advisory service #prodmgmt #prodmktg\",\"http://www.blackblot.com/bcp/\"",97.289564055477513]
["2015-07-30","2015-07-30","01:00:00",3,"Blackblot content retention tools for product managers","http://www.blackblot.com/retention/",89,"07/30/2015 01:00,\"Blackblot content retention tools for product managers\",\"http://www.blackblot.com/retention/\"",71.2535706536883]
["2015-08-01","2015-08-01","13:45:00",4,"The Powered by Blackblot™ KB is a dynamic repository of #prodmgmt  knowledge based on PMTK methodology","http://www.blackblot.com/kb/",129,"08/01/2015 13:45,\"The Powered by Blackblot™ KB is a dynamic repository of #prodmgmt knowledge based on PMTK methodology\",\"http://www.blackblot.com/kb/\"",89.373399497785996]
["2015-08-03","2015-08-03","15:00:00",5,"What makes Blackblot different?","http://www.blackblot.com/",56,"08/03/2015 15:00,\"What makes Blackblot different?\",\"http://www.blackblot.com/\"",82.609607537447133]
["2015-08-05","2015-08-05","09:00:00",6,"Are you a technology professional considering a role in product management?","http://www.blackblot.com/tpm/",104,"08/05/2015 09:00,\"Are you a technology professional considering a role in product management?\",\"http://www.blackblot.com/tpm/\"",71.081438729354161]
["2015-08-07","2015-08-07","23:30:00",7,"The KB provides product managers with categorized product management information via online searchable platform","http://www.blackblot.com/kb/",139,"08/07/2015 23:30,\"The KB provides product managers with categorized product management information via online searchable platform\",\"http://www.blackblot.com/kb/\"",12.711246620622941]
["2015-08-09","2015-08-09","01:00:00",8,"Check the benefits of Blackblot Private Product Management and Marketing Training","http://www.blackblot.com/private/",114,"08/09/2015 01:00,\"Check the benefits of Blackblot Private Product Management and Marketing Training\",\"http://www.blackblot.com/private/\"",28.469528934722554]
{"$rows_left_out":93}
{"sheet":"Blackblot Hootsuite Uploader 3","index":3,"n_rows":107,"n_cols":9,"rows_kept":107,"cut":false,"hidden":false,"merged":[[0,3,2,5]]}
["Start Date:","2015-07-26",null,"Blackblot® Hootsuite Uploader Matrix"]
["Skipday:",2]
["Channel:","Twitter "]
["Date Format:","USA"]
["Check URL",true,null,null,null,null,{"$f":"VLOOKUP(B3,Settings!C8:D11,2)","v":140}]
[]
["Weekday","Date","Hour","#","Message","URL","Text Length","Uploader","Randomizer"]
[{"$f":"+B8","v":"2015-07-26"},{"$f":"+B1","v":"2015-07-26"},"09:00:00",1,"The Blackblot Strategic Product Leader™ (SPLD) educational program is a an advanced product leadership course. ","http://www.blackblot.com/spld/ ",{"$f":"LEN(TRIM(E8)) + LEN(TRIM(F8))","v":140},{"$f":"CONCATENATE(IF($B$4=\"USA\",CONCATENATE(TEXT(MONTH(B8),\"00\"),\"/\",TEXT(DAY(B8),\"00\"),\"/\",TEXT(YEAR(B8),\"0000\")),CONCATENATE(TEXT(DAY(B8),\"00\"),\"/\",TEXT(MONTH(B8),\"00\"),\"/\",TEXT(YEAR(B8),\"0000\"))),\" \",TEXT(HOUR(C8),\"00\"),\":\",TEXT(MINUTE(C8),\"00\"),\",\"&CHAR(34),TRIM(E8),CHAR(34)&\",\"&CHAR(34),TRIM(F8),CHAR(34))","v":"07/26/2015 09:00,\"The Blackblot Strategic Product Leader™ (SPLD) educational program is a an advanced product leadership course.\",\"http://www.blackblot.com/spld/\""},{"$f":"RAND()*100","v":42.622402133284645}]
["2015-07-28",{"$f":"+B8+$B$2","v":"2015-07-28"},"23:30:00",2,"Does your company have a uniform terminology and consistent processes for product management?","http://www.blackblot.com/glossary/",127,"07/28/2015 23:30,\"Does your company have a uniform terminology and consistent processes for product management?\",\"http://www.blackblot.com/glossary/\"",58.300010406969513]
["2015-07-30","2015-07-30","01:00:00",3,"The Powered by Blackblot™ KB is a dynamic repository of #prodmgmt  knowledge based on PMTK methodology","http://www.blackblot.com/kb/",129,"07/30/2015 01:00,\"The Powered by Blackblot™ KB is a dynamic repository of #prodmgmt knowledge based on PMTK methodology\",\"http://www.blackblot.com/kb/\"",24.767658685906046]
["2015-08-01","2015-08-01","13:45:00",4,"Master Blackblot Product Management Professional ™ rightfully earned #prodmgmt","http://www.blackblot.com/master-bpmp/",115,"08/01/2015 13:45,\"Master Blackblot Product Management Professional ™ rightfully earned #prodmgmt\",\"http://www.blackblot.com/master-bpmp/\"",31.534107945724699]
["2015-08-03","2015-08-03","15:00:00",5,"Are you a technology professional considering a role in product management?","http://www.blackblot.com/tpm/",104,"08/03/2015 15:00,\"Are you a technology professional considering a role in product management?\",\"http://www.blackblot.com/tpm/\"",17.869190315366712]
["2015-08-05","2015-08-05","09:00:00",6,"Blackblot Training Program Benefits - comprehensive study program #prodmgmt #HR","http://www.blackblot.com/benefits/",113,"08/05/2015 09:00,\"Blackblot Training Program Benefits - comprehensive study program #prodmgmt #HR\",\"http://www.blackblot.com/benefits/\"",60.253314488933455]
["2015-08-07","2015-08-07","23:30:00",7,"The KB provides product managers with categorized product management information via online searchable platform","http://www.blackblot.com/kb/",139,"08/07/2015 23:30,\"The KB provides product managers with categorized product management information via online searchable platform\",\"http://www.blackblot.com/kb/\"",29.364844547560342]
["2015-08-09","2015-08-09","01:00:00",8,"Blackblot Video - What is Product Management? #prodmgmt #prodmktg","http://www.blackblot.com/video/",96,"08/09/2015 01:00,\"Blackblot Video - What is Product Management? #prodmgmt #prodmktg\",\"http://www.blackblot.com/video/\"",64.671933239237831]
{"$rows_left_out":93}
{"sheet":"Blackblot Hootsuite Uploader 4","index":4,"n_rows":107,"n_cols":9,"rows_kept":107,"cut":false,"hidden":false,"merged":[[0,3,2,5]]}
["Start Date:","2015-07-26",null,"Blackblot® Hootsuite Uploader Matrix"]
["Skipday:",2]
["Channel:","Twitter "]
["Date Format:","USA"]
["Check URL",true,null,null,null,null,{"$f":"VLOOKUP(B3,Settings!C8:D11,2)","v":140}]
[]
["Weekday","Date","Hour","#","Message","URL","Text Length","Uploader","Randomizer"]
[{"$f":"+B8","v":"2015-07-26"},{"$f":"+B1","v":"2015-07-26"},"09:00:00",1,"Check the benefits of Blackblot Private Product Management and Marketing Training","http://www.blackblot.com/private/",{"$f":"LEN(TRIM(E8)) + LEN(TRIM(F8))","v":114},{"$f":"CONCATENATE(IF($B$4=\"USA\",CONCATENATE(TEXT(MONTH(B8),\"00\"),\"/\",TEXT(DAY(B8),\"00\"),\"/\",TEXT(YEAR(B8),\"0000\")),CONCATENATE(TEXT(DAY(B8),\"00\"),\"/\",TEXT(MONTH(B8),\"00\"),\"/\",TEXT(YEAR(B8),\"0000\"))),\" \",TEXT(HOUR(C8),\"00\"),\":\",TEXT(MINUTE(C8),\"00\"),\",\"&CHAR(34),TRIM(E8),CHAR(34)&\",\"&CHAR(34),TRIM(F8),CHAR(34))","v":"07/26/2015 09:00,\"Check the benefits of Blackblot Private Product Management and Marketing Training\",\"http://www.blackblot.com/private/\""},{"$f":"RAND()*100","v":85.524273383326104}]
["2015-07-28",{"$f":"+B8+$B$2","v":"2015-07-28"},"23:30:00",2,"Career support is an integral part of an employee's well-being and will translate to better job performance","http://www.blackblot.com/career/",139,"07/28/2015 23:30,\"Career support is an integral part of an employee's well-being and will translate to better job performance\",\"http://www.blackblot.com/career/\"",63.836214763070252]
["2015-07-30","2015-07-30","01:00:00",3,"A new tool for HR managers and recruiters: The Blackblot Psychometric Test™ (BPT) #ProductManagement #HR","http://www.blackblot.com/bpt/",133,"07/30/2015 01:00,\"A new tool for HR managers and recruiters: The Blackblot Psychometric Test™ (BPT) #ProductManagement #HR\",\"http://www.blackblot.com/bpt/\"",70.425045600100233]
["2015-08-01","2015-08-01","13:45:00",4,"Gauge the level of maturity of the #prodmgmt practice at your company. ","http://www.blackblot.com/pmeval/",102,"08/01/2015 13:45,\"Gauge the level of maturity of the #prodmgmt practice at your company.\",\"http://www.blackblot.com/pmeval/\"",91.390474642148817]
["2015-08-03","2015-08-03","15:00:00",5,"What makes Blackblot different?","http://www.blackblot.com/",56,"08/03/2015 15:00,\"What makes Blackblot different?\",\"http://www.blackblot.com/\"",43.018192739684956]
["2015-08-05","2015-08-05","09:00:00",6,"The KB provides product managers with categorized product management information via online searchable platform","http://www.blackblot.com/kb/",139,"08/05/2015 09:00,\"The KB provides product managers with categorized product management information via online searchable platform\",\"http://www.blackblot.com/kb/\"",90.05695636246061]
["2015-08-07","2015-08-07","23:30:00",7,"Check this out: resources for Product Managers powered by Blackblot #prodmgmt #prodmktg","http://www.blackblot.com/resources/",122,"08/07/2015 23:30,\"Check this out: resources for Product Managers powered by Blackblot #prodmgmt #prodmktg\",\"http://www.blackblot.com/resources/\"",26.180823237791738]
["2015-08-09","2015-08-09","01:00:00",8,"Blackblot enables product managers to be more productive via unique and unsurpassed offering #prodmgmt #PMTK","http://www.blackblot.com/offering/",142,"08/09/2015 01:00,\"Blackblot enables product managers to be more productive via unique and unsurpassed offering #prodmgmt #PMTK\",\"http://www.blackblot.com/offering/\"",47.96430691240019]
{"$rows_left_out":93}
{"sheet":"Blackblot Hootsuite Uploader 5","index":5,"n_rows":107,"n_cols":9,"rows_kept":107,"cut":false,"hidden":false,"merged":[[0,3,2,5]]}
["Start Date:","2015-07-26",null,"Blackblot® Hootsuite Uploader Matrix"]
["Skipday:",2]
["Channel:","Twitter "]
["Date Format:","USA"]
["Check URL",true,null,null,null,null,{"$f":"VLOOKUP(B3,Settings!C8:D11,2)","v":140}]
[]
["Weekday","Date","Hour","#","Message","URL","Text Length","Uploader","Randomizer"]
[{"$f":"+B8","v":"2015-07-26"},{"$f":"+B1","v":"2015-07-26"},"09:00:00",1,"Blackblot Strategic Product Management ™ - occupational core & advanced skills training program for professionals","http://www.blackblot.com/spmr/",{"$f":"LEN(TRIM(E8)) + LEN(TRIM(F8))","v":143},{"$f":"CONCATENATE(IF($B$4=\"USA\",CONCATENATE(TEXT(MONTH(B8),\"00\"),\"/\",TEXT(DAY(B8),\"00\"),\"/\",TEXT(YEAR(B8),\"0000\")),CONCATENATE(TEXT(DAY(B8),\"00\"),\"/\",TEXT(MONTH(B8),\"00\"),\"/\",TEXT(YEAR(B8),\"0000\"))),\" \",TEXT(HOUR(C8),\"00\"),\":\",TEXT(MINUTE(C8),\"00\"),\",\"&CHAR(34),TRIM(E8),CHAR(34)&\",\"&CHAR(34),TRIM(F8),CHAR(34))","v":"07/26/2015 09:00,\"Blackblot Strategic Product Management ™ - occupational core & advanced skills training program for professionals\",\"http://www.blackblot.com/spmr/\""},{"$f":"RAND()*100","v":2.7460573708957603}]
["2015-07-28",{"$f":"+B8+$B$2","v":"2015-07-28"},"23:30:00",2,"Looking to hire a Product Manager? Check out Blackblot - Alumni group on LinkedIn","http://www.blackblot.com/community/",116,"07/28/2015 23:30,\"Looking to hire a Product Manager? Check out Blackblot - Alumni group on LinkedIn\",\"http://www.blackblot.com/community/\"",29.897293532963154]
["2015-07-30","2015-07-30","01:00:00",3,"Blackblot's book on #prodmgmt  - The Product Manager's Toolkit™","http://www.blackblot.com/pmtk-book/",97,"07/30/2015 01:00,\"Blackblot's book on #prodmgmt - The Product Manager's Toolkit™\",\"http://www.blackblot.com/pmtk-book/\"",23.318456877336303]
["2015-08-01","2015-08-01","13:45:00",4,"The Powered by Blackblot™ KB is a dynamic repository of #prodmgmt  knowledge based on PMTK methodology","http://www.blackblot.com/kb/",129,"08/01/2015 13:45,\"The Powered by Blackblot™ KB is a dynamic repository of #prodmgmt knowledge based on PMTK methodology\",\"http://www.blackblot.com/kb/\"",94.465696942144945]
["2015-08-03","2015-08-03","15:00:00",5,"Market-Value Pricing Model - Blackblot PMTK (Blackblot Product Manager's Toolkit™) #PMTK #prodmgmt #pricing","http://www.blackblot.com/mvp-model/",142,"08/03/2015 15:00,\"Market-Value Pricing Model - Blackblot PMTK (Blackblot Product Manager's Toolkit™) #PMTK #prodmgmt #pricing\",\"http://www.blackblot.com/mvp-model/\"",3.8233453308984644]
["2015-08-05","2015-08-05","09:00:00",6,"Blackblot - the practical path to excellence in #prodmgmt & #prodmktg wherever you start from.","http://www.blackblot.com/",119,"08/05/2015 09:00,\"Blackblot - the practical path to excellence in #prodmgmt & #prodmktg wherever you start from.\",\"http://www.blackblot.com/\"",59.612193341804307]
["2015-08-07","2015-08-07","23:30:00",7,"Blackblot enables product managers to be more productive via unique and unsurpassed offering #prodmgmt #PMTK","http://www.blackblot.com/offering/",142,"08/07/2015 23:30,\"Blackblot enables product managers to be more productive via unique and unsurpassed offering #prodmgmt #PMTK\",\"http://www.blackblot.com/offering/\"",37.262903087135399]
["2015-08-09","2015-08-09","01:00:00",8,"Career support is an integral part of an employee's well-being and will translate to better job performance","http://www.blackblot.com/career/",139,"08/09/2015 01:00,\"Career support is an integral part of an employee's well-being and will translate to better job performance\",\"http://www.blackblot.com/career/\"",87.308953576557727]
{"$rows_left_out":93}
{"sheet":"Blackblot Hootsuite Uploader 6","index":6,"n_rows":107,"n_cols":9,"rows_kept":107,"cut":false,"hidden":false,"merged":[[0,3,2,5]]}
["Start Date:","2015-07-26",null,"Blackblot® Hootsuite Uploader Matrix"]
["Skipday:",2]
["Channel:","Twitter "]
["Date Format:","USA"]
["Check URL",true,null,null,null,null,{"$f":"VLOOKUP(B3,Settings!C8:D11,2)","v":140}]
[]
["Weekday","Date","Hour","#","Message","URL","Text Length","Uploader","Randomizer"]
[{"$f":"+B8","v":"2015-07-26"},{"$f":"+B1","v":"2015-07-26"},"09:00:00",1,"Blackblot Training Program Benefits - comprehensive study program #prodmgmt #HR","http://www.blackblot.com/benefits/",{"$f":"LEN(TRIM(E8)) + LEN(TRIM(F8))","v":113},{"$f":"CONCATENATE(IF($B$4=\"USA\",CONCATENATE(TEXT(MONTH(B8),\"00\"),\"/\",TEXT(DAY(B8),\"00\"),\"/\",TEXT(YEAR(B8),\"0000\")),CONCATENATE(TEXT(DAY(B8),\"00\"),\"/\",TEXT(MONTH(B8),\"00\"),\"/\",TEXT(YEAR(B8),\"0000\"))),\" \",TEXT(HOUR(C8),\"00\"),\":\",TEXT(MINUTE(C8),\"00\"),\",\"&CHAR(34),TRIM(E8),CHAR(34)&\",\"&CHAR(34),TRIM(F8),CHAR(34))","v":"07/26/2015 09:00,\"Blackblot Training Program Benefits - comprehensive study program #prodmgmt #HR\",\"http://www.blackblot.com/benefits/\""},{"$f":"RAND()*100","v":84.182439520431828}]
["2015-07-28",{"$f":"+B8+$B$2","v":"2015-07-28"},"23:30:00",2,"Master Blackblot Product Management Professional ™ rightfully earned #prodmgmt","http://www.blackblot.com/master-bpmp/",115,"07/28/2015 23:30,\"Master Blackblot Product Management Professional ™ rightfully earned #prodmgmt\",\"http://www.blackblot.com/master-bpmp/\"",4.1589202929180225]
["2015-07-30","2015-07-30","01:00:00",3,"Check the benefits of Blackblot Private Product Management and Marketing Training","http://www.blackblot.com/private/",114,"07/30/2015 01:00,\"Check the benefits of Blackblot Private Product Management and Marketing Training\",\"http://www.blackblot.com/private/\"",30.610007164365229]
["2015-08-01","2015-08-01","13:45:00",4,"Gauge the level of maturity of the #prodmgmt practice at your company. ","http://www.blackblot.com/pmeval/",102,"08/01/2015 13:45,\"Gauge the level of maturity of the #prodmgmt practice at your company.\",\"http://www.blackblot.com/pmeval/\"",62.201148888289545]
["2015-08-03","2015-08-03","15:00:00",5,"Blackblot Strategic Product Management ™ - occupational core & advanced skills training program for professionals","http://www.blackblot.com/spmr/",143,"08/03/2015 15:00,\"Blackblot Strategic Product Management ™ - occupational core & advanced skills training program for professionals\",\"http://www.blackblot.com/spmr/\"",28.530722631791463]
["2015-08-05","2015-08-05","09:00:00",6,"Are you a technology professional considering a role in product management?","http://www.blackblot.com/tpm/",104,"08/05/2015 09:00,\"Are you a technology professional considering a role in product management?\",\"http://www.blackblot.com/tpm/\"",59.375321223839336]
["2015-08-07","2015-08-07","23:30:00",7,"What is considered to be a good ratio of product engineers to product managers? #prodmgmt","http://www.blackblot.com/kb/dev-pm/pm-to-dev-ratio/",140,"08/07/2015 23:30,\"What is considered to be a good ratio of product engineers to product managers? #prodmgmt\",\"http://www.blackblot.com/kb/dev-pm/pm-to-dev-ratio/\"",73.930327171780547]
["2015-08-09","2015-08-09","01:00:00",8,"The KB provides product managers with categorized product management information via online searchable platform","http://www.blackblot.com/kb/",139,"08/09/2015 01:00,\"The KB provides product managers with categorized product management information via online searchable platform\",\"http://www.blackblot.com/kb/\"",40.541442265388874]
{"$rows_left_out":93}
{"sheet":"Settings","index":7,"n_rows":17,"n_cols":6,"rows_kept":17,"cut":false,"hidden":false,"merged":[[2,1,2,5],[5,1,5,8],[6,2,6,3]]}
[]
[]
[null,"Blackblot® PMTK Hootsuite Uploader Matrix Settings"]
[]
[]
[null,"List Tables for Drop Down menus"]
[null,"Skipday","Channel and Message Length",null,"Date Format","Check URL"]
[null,1,"Facebook",500,"Europe",true]
[null,2,"Google+",500,"USA",false]
[null,3,"LinkedIn  ",689]
[null,4,"Twitter ",140]
[null,5]
[null,6]
[null,7]
[null,8]
{"$rows_left_out":3}
{"sheet":"Instructions","index":8,"n_rows":20,"n_cols":2,"rows_kept":20,"cut":false,"hidden":false,"merged":[[9,1,9,7],[10,1,10,7],[11,1,11,7],[16,1,16,7],[19,1,19,7],[2,1,2,5],[5,1,5,7],[6,1,6,7],[7,1,7,7],[8,1,8,7]]}
[]
[]
[null,"Blackblot® Hootsuite Uploader Matrix"]
[]
[]
[null,"Blackblot Hootsuite Uploader Matrix - Instructions"]
[null,"1. In the \"Blackblot Hootsuite Uploader\" spreadsheet, set the Start Date, Skipday, Channel,  Date Format and Check URL parameters."]
[null,"2. In the \"Blackblot Hootsuite Uploader\" spreadsheet, enter the messages and URLs that will be scheduled."]
[null,"3. In the \"Blackblot Hootsuite Uploader\" spreadsheet, use the \"Randomize\" button to randomly list the messages (if desired)."]
[null,"4. In the \"Blackblot Hootsuite Uploader\" spreadsheet, use the \"Save\" button to create and save the bulk message file."]
[]
[null,"Note the cell comments that provide additional information."]
[]
[]
[]
{"$rows_left_out":5}